{"text_format":"1","workbook":"xlsx","n_sheets":17,"sheets":["Instructions","Regional","Urban","Gaged Flow","TC 61-100","Region1","Region 2","Region 3","Region 4","Region 5","Region 6","Region 7","TN2","Coefficients","Table 1","P2,2","Update Log"],"not_rendered":{"charts":0,"images":12,"macros":1,"external_links":0,"defined_names":2,"comments":3,"pivot_tables":0},"unopened":[],"bounds":{"document_bytes":16777216,"sheet_cells":100000,"rows_first":2000,"rows_last":500,"rows_between":2000,"halvings":0,"cell_chars":16384,"cell_head_chars":4096},"cells_cut":0,"cells_raw":0,"read":"whole","date_system":"1900"}

{"sheet":"Instructions","index":0,"n_rows":75,"n_cols":3,"rows_kept":75,"cut":false,"hidden":false,"merged":[]}
["Instructions Worksheet"]
[null,"Conversion of drainage area from acres to square miles and flow length from feet to miles is provided."]
[null,"   Conversion from square miles to acres or miles to feet is not an option."]
[null,"Enter Hydrologic Region identification and drainage area.  Stream slope variables are applicable in regions 1 and 4."]
[null,"A macro is used to examine all entered options and to compute and display missing output variables by pressing ctrl-r."]
[null,"If only 1 flow region is used and no urbanization technique is used, the macro is not required."]
{"$rows_left_out":70}
{"sheet":"Regional","index":1,"n_rows":36,"n_cols":43,"rows_kept":36,"cut":false,"hidden":false,"merged":[[22,49,22,52],[23,24,23,28],[23,4,23,8],[26,19,26,23],[27,14,27,18],[26,24,26,28],[24,0,24,3],[25,0,25,3],[26,0,26,3],[27,0,27,3],[24,9,24,13],[27,4,27,8],[26,4,26,8],[24,4,24,8],[25,4,25,8],[25,24,25,28],[25,9,25,13],[25,14,25,18],[25,19,25,23],[24,19,24,23],[27,19,27,23],[27,24,27,28],[27,9,27,13],[7,19,7,23],[22,0,22,3],[21,0,21,3],[19,24,19,28],[22,4,22,8],[22,9,22,13],[22,14,22,18],[20,0,20,3],[19,4,19,8],[14,19,14,23],[13,19,13,23],[20,19,20,23],[12,14,12,18],[11,9,11,13],[12,9,12,13],[9,4,9,18],[8,9,8,13],[8,14,8,18],[14,9,14,13],[8,19,8,23],[10,0,10,3],[8,0,8,3],[9,0,9,3],[15,24,15,28],[8,4,8,8],[2,9,2,18],[3,0,3,3],[4,0,4,3],[5,9,5,13],[3,4,3,8],[5,4,5,8],[3,9,3,18],[5,14,5,18],[5,0,5,3],[7,0,7,3],[6,0,6,3],[6,4,6,8],[6,9,6,13],[7,4,7,8],[7,9,7,13],[14,4,14,8],[15,4,15,8],[13,14,13,18],[0,27,0,28],[0,2,0,26],[2,19,2,28],[4,19,4,23],[3,19,3,23],[2,0,2,3],[1,0,1,28],[10,24,10,28],[9,19,9,23],[6,14,6,18],[5,24,5,28],[7,14,7,18],[7,24,7,28],[10,14,10,17],[10,19,10,23],[3,24,3,28],[4,14,4,18],[4,24,4,28],[4,4,4,8],[4,9,4,13],[2,4,2,8],[15,9,15,13],[15,19,15,23],[19,19,19,23],[18,19,18,23],[16,4,16,8],[16,9,16,13],[16,19,16,23],[16,14,16,18],[17,9,17,13],[18,4,18,8],[18,14,18,18],[18,9,18,13],[18,24,18,28],[19,14,19,18],[19,0,19,3],[19,9,19,13],[29,19,29,23],[17,4,17,8],[17,14,17,18],[17,19,17,23],[26,14,26,18],[20,4,20,18],[23,19,23,23],[21,24,21,28],[22,19,22,23],[21,4,21,7],[21,9,21,12],[21,14,21,17],[21,19,21,23],[20,24,20,28],[22,24,22,28],[23,9,23,13],[23,14,23,18],[23,0,23,3],[28,0,28,3],[28,4,28,8],[14,0,14,3],[15,0,15,3],[16,0,16,3],[14,14,14,18],[15,14,15,18],[13,4,13,8],[17,24,17,28],[35,0,35,4],[29,9,29,13],[29,14,29,18],[24,14,24,18],[26,9,26,13],[24,24,24,28],[31,0,31,31],[32,0,32,31],[33,0,33,31],[34,0,34,31],[29,4,29,8],[29,0,29,3],[29,24,29,28],[28,24,28,28],[28,9,28,13],[28,14,28,18],[28,19,28,23],[0,0,0,1],[18,0,18,3],[13,9,13,13],[17,0,17,3],[16,24,16,28],[5,19,5,23],[13,24,13,28],[9,24,9,28],[8,24,8,28],[12,19,12,23],[11,14,11,18],[10,4,10,7],[10,9,10,12],[12,24,12,28],[14,24,14,28],[11,19,11,23],[11,24,11,28],[6,24,6,28],[6,19,6,23],[11,0,11,3],[11,4,11,8],[12,0,12,3],[12,4,12,8],[13,0,13,3]]}
[null,null,"REGIONAL FLOW CALCULATIONS",null,null,null,null,null,null,null,null,null,null,null,null,null,null,null,null,null,null,null,null,null,null,null,null,"07.19",null,null,null,null,null,null,null,"Region","Size",null,"Messages"]
["FOR SITES ON RURAL, UNGAGED, UNREGULATED STREAMS"]
["Region",null,null,null,"Drainage",null,null,null,null,"Elevation on longest",null,null,null,null,null,null,null,null,null,"Flow Path",null,null,null,null,null,null,null,null,null,null,null,null,null,null,null,1,0.3,null,"Drainage area less than regression limit."]
["ID",null,null,null,"Area",null,null,null,null,"flow path located:",null,null,null,null,null,null,null,null,null,"Length",null,null,null,null,"Slope"]
[null,null,null,null,"(sq.mi.)",null,null,null,null,"10% from site",null,null,null,null,"85% from site",null,null,null,null,"(miles)",null,null,null,null,"(ft/mile)",null,null,null,null,"Variable Limit Messages",null,null,null,null,null,"Region","Table",null,"Region","Low","High","Low","High"]
[1,null,null,null,0.64,null,null,null,null,856,null,null,null,null,922,null,null,null,null,1.05,null,null,null,null,{"$f":"IF(OR(A6=5,A6=1,A6=4,A6=\"Jefferson\"),IF(J6>O6,\"Ck Elevation order\",IF(O6=0,\"Enter 85% elev.\",IF(J6=0,\"Enter 10% elev.\",IF(J6>O6,\"Check Elevations\",IF(T6=0,\"Enter str.length\",(O6-J6)/(T6*0.75)))))),\"N/A\")","v":83.809523809523796},null,null,null,null,{"$f":"IF(E6=\"\",\"N/A\",IF(E6<VLOOKUP(A6,$AM$7:$AQ$16,2),$AM$3,IF(E6>VLOOKUP(A6,$AM$7:$AQ$16,3),$AM$4,IF(Y6=\"N/A\",#REF!,IF(Y6<VLOOKUP(A6,$AM$7:$AQ$16,4),#REF!,IF(Y6>VLOOKUP(A6,$AM$7:$AQ$16,5),#REF!,#REF!))))))","v":{"$error":"#REF!"}},null,null,null,null,null,null,"Index",null,null,"Area","Area","Slope","Slope"]
{"$rows_left_out":31}
{"sheet":"Urban","index":2,"n_rows":122,"n_cols":75,"rows_kept":122,"cut":false,"hidden":false,"merged":[[23,0,23,21],[3,0,3,57],[6,0,6,9],[7,0,7,9],[7,10,7,21],[6,10,6,21],[10,0,10,9],[10,10,10,57],[8,0,8,9],[8,10,8,21],[9,22,9,57],[8,46,8,57],[9,0,9,9],[9,10,9,21],[8,22,8,33],[8,34,8,45],[6,46,6,57],[7,46,7,57],[6,22,6,33],[7,22,7,33],[6,34,6,45],[14,22,14,33],[14,34,14,45],[12,10,12,25],[2,5,2,21],[2,22,2,26],[2,27,2,57],[0,52,1,57],[1,0,1,15],[0,0,0,15],[0,16,1,51],[2,0,2,4],[4,34,4,45],[15,0,15,9],[4,46,4,57],[5,46,5,57],[5,34,5,45],[4,0,4,9],[5,0,5,9],[4,10,4,21],[4,22,4,33],[5,22,5,33],[12,55,12,57],[12,46,12,54],[7,34,7,45],[5,10,5,21],[13,0,13,21],[32,33,32,42],[32,43,32,45],[22,26,22,28],[32,26,32,28],[12,26,12,28],[12,29,12,32],[13,27,13,57],[22,10,22,25],[22,29,22,32],[22,33,22,42],[22,43,22,45],[18,46,18,57],[16,46,16,57],[17,46,17,57],[20,10,20,57],[22,46,22,54],[15,10,15,21],[23,22,23,26],[23,27,23,57],[17,10,17,21],[17,22,17,33],[17,34,17,45],[16,10,16,21],[16,22,16,33],[22,55,22,57],[14,46,14,57],[15,46,15,57],[12,43,12,45],[21,0,22,9],[13,22,13,26],[12,33,12,42],[20,0,20,9],[11,0,12,9],[11,10,11,57],[19,0,19,9],[19,10,19,21],[17,0,17,9],[16,0,16,9],[16,34,16,45],[19,22,19,57],[18,0,18,9],[18,10,18,21],[18,22,18,33],[18,34,18,45],[15,22,15,33],[15,34,15,45],[14,0,14,9],[14,10,14,21],[28,0,28,9],[28,10,28,21],[28,22,28,33],[28,34,28,45],[27,0,27,9],[27,10,27,21],[27,22,27,33],[27,34,27,45],[24,46,24,57],[24,0,24,9],[24,10,24,21],[24,22,24,33],[24,34,24,45],[31,0,32,9],[29,0,29,9],[29,10,29,21],[29,22,29,57],[30,0,30,9],[30,10,30,57],[32,10,32,25],[21,10,21,57],[27,46,27,57],[28,46,28,57],[25,46,25,57],[32,46,32,54],[32,55,32,57],[31,10,31,57],[32,29,32,32],[26,46,26,57],[25,0,25,9],[25,10,25,21],[25,22,25,33],[25,34,25,45],[26,0,26,9],[26,10,26,21],[26,22,26,33],[26,34,26,45]]}
["Kentucky Transportation Cabinet",null,null,null,null,null,null,null,null,null,null,null,null,null,null,null,"BASIN URBANIZATION COMPUTATIONS",null,null,null,null,null,null,null,null,null,null,null,null,null,null,null,null,null,null,null,null,null,null,null,null,null,null,null,null,null,null,null,null,null,null,null,"1 of 1",null,null,null,null,null,null,null,null,null,null,null,null,null,null,null,null,null,null,null,null,"COUNTY",0]
["Division of Highway Design  02-17",null,null,null,null,null,null,null,null,null,null,null,null,null,null,null,null,null,null,null,null,null,null,null,null,null,null,null,null,null,null,null,null,null,null,null,null,null,null,null,null,null,null,null,null,null,null,null,null,null,null,null,null,null,null,null,null,null,null,null,null,null,null,null,null,null,null,null,null,null,null,null,null,null,1]
["County :",null,null,null,null,"HENRY",null,null,null,null,null,null,null,null,null,null,null,null,null,null,null,null,"Region:",null,null,null,null,{"$f":"Regional!A6","v":1},null,null,null,null,null,null,null,null,null,null,null,null,null,null,null,null,null,null,null,null,null,null,null,null,null,null,null,null,null,null,null,null,null,null,null,null,null,null,null,null,null,null,null,null,null,"ADAIR"]
[null,null,null,null,null,null,null,null,null,null,null,null,null,null,null,null,null,null,null,null,null,null,null,null,null,null,null,null,null,null,null,null,null,null,null,null,null,null,null,null,null,null,null,null,null,null,null,null,null,null,null,null,null,null,null,null,null,null,null,null,null,null,null,null,null,null,null,null,null,null,null,null,null,"ALLEN"]
["Portion of Drainage Area",null,null,null,null,null,null,null,null,null,"Channel Improvement",null,null,null,null,null,null,null,null,null,null,null,"Channel Lining",null,null,null,null,null,null,null,null,null,null,null,"Storm Sewers",null,null,null,null,null,null,null,null,null,null,null,"Curb & Gutter Streets",null,null,null,null,null,null,null,null,null,null,null,null,null,null,null,null,null,null,null,null,null,null,null,null,null,null,"ANDERSON"]
["Upper Third",null,null,null,null,null,null,null,null,null,1,null,null,null,null,null,null,null,null,null,null,null,0,null,null,null,null,null,null,null,null,null,null,null,0,null,null,null,null,null,null,null,null,null,null,null,0,null,null,null,null,null,null,null,null,null,null,null,null,null,null,null,null,null,null,null,null,null,null,null,null,null,null,"BALLARD"]
{"$rows_left_out":117}
{"sheet":"Gaged Flow","index":3,"n_rows":226,"n_cols":94,"rows_kept":226,"cut":false,"hidden":false,"merged":[[6,5,6,9],[7,0,7,4],[5,30,5,44],[4,28,4,29],[5,28,5,29],[6,10,6,14],[7,10,7,14],[2,0,2,4],[2,5,2,21],[2,22,2,26],[5,0,5,4],[5,5,5,9],[5,10,5,14],[5,45,5,51],[3,40,3,45],[3,46,3,51],[8,5,8,9],[0,0,0,15],[5,15,5,27],[4,15,4,27],[2,27,2,39],[2,45,2,51],[3,0,3,3],[3,4,3,21],[3,22,3,25],[3,26,3,39],[4,30,4,44],[0,46,1,51],[1,0,1,15],[0,16,1,45],[2,40,2,44],[15,4,15,51],[4,0,4,4],[4,5,4,9],[4,45,4,51],[8,10,8,14],[4,10,4,14],[10,0,10,4],[11,10,11,14],[6,0,6,4],[12,15,12,51],[6,15,6,51],[7,15,7,51],[9,0,9,4],[8,15,8,51],[8,0,8,4],[7,5,7,9],[11,0,11,4],[12,10,12,14],[12,5,12,9],[10,10,10,14],[9,10,9,14],[14,0,15,3],[14,4,14,51],[9,15,9,51],[10,15,10,51],[11,15,11,51],[9,5,9,9],[12,0,12,4],[11,5,11,9],[10,5,10,9]]}
["Kentucky Transportation Cabinet",null,null,null,null,null,null,null,null,null,null,null,null,null,null,null,"GAGED FLOW COMPUTATIONS",null,null,null,null,null,null,null,null,null,null,null,null,null,null,null,null,null,null,null,null,null,null,null,null,null,null,null,null,null,"1 of 1"]
["Division of Highway Design  7-08",null,null,null,null,null,null,null,null,null,null,null,null,null,null,null,null,null,null,null,null,null,null,null,null,null,null,null,null,null,null,null,null,null,null,null,null,null,null,null,null,null,null,null,null,null,null,null,null,null,null,null,null,null,null,null,null,null,null,null,null,null,null,null,null,null,null,null,null,null,null,null,null,null,null,null,null,null,null,null,null,null,null,null,null,null,null,null,null,null,null,null,null,"Gage"]
["County :",null,null,null,null,{"$f":"'TC 61-100'!F3:Y3","v":"MARION"},null,null,null,null,null,null,null,null,null,null,null,null,null,null,null,null,"Route :",null,null,null,null,{"$f":"'TC 61-100'!AE3","v":"KY 100"},null,null,null,null,null,null,null,null,null,null,null,null,"Item # :",null,null,null,null,{"$f":"'TC 61-100'!AZ3","v":"3-8503"},null,null,null,null,null,null,null,null,null,null,null,null,null,null,null,null,null,null,null,null,null,null,null,null,null,null,null,null,null,null,null,null,null,null,null,null,null,null,null,null,null,null,null,null,null,null,null,"number"]
["UPN :",null,null,null,{"$f":"'TC 61-100'!E4:Y4","v":0},null,null,null,null,null,null,null,null,null,null,null,null,null,null,null,null,null,"FPN :",null,null,null,{"$f":"'TC 61-100'!AD4","v":0},null,null,null,null,null,null,null,null,null,null,null,null,null,"Station :",null,null,null,null,null,{"$f":"'TC 61-100'!BA4","v":0}]
["RI",null,null,null,null,"Qr",null,null,null,null,"Qg",null,null,null,null,"Gage location, Region:",null,null,null,null,null,null,null,null,null,null,null,null,6,null,"Upstream Gage No.:",null,null,null,null,null,null,null,null,null,null,null,null,null,null,3320000,null,null,null,null,null,null,null,null,null,null,null,null,null,null,null,null,null,null,null,null,null,null,null,null,null,null,null,null,null,null,null,null,null,null,null,null,null,null,null,null,null,null,null,null,null,null,null,3207965]
["(yrs)",null,null,null,null,"(cfs)",null,null,null,null,"(cfs)",null,null,null,null,"Gage location, Region:",null,null,null,null,null,null,null,null,null,null,null,null,null,null,"Downstream Gage No.:",null,null,null,null,null,null,null,null,null,null,null,null,null,null,null,null,null,null,null,null,null,null,null,null,null,null,null,null,null,null,null,null,null,null,null,null,null,null,null,null,null,null,null,null,null,null,null,null,null,null,null,null,null,null,null,null,null,null,null,null,null,null,3208000]
{"$rows_left_out":221}
{"sheet":"TC 61-100","index":4,"n_rows":121,"n_cols":88,"rows_kept":121,"cut":false,"hidden":false,"merged":[[58,15,58,20],[45,48,45,57],[46,48,46,57],[47,48,47,57],[45,40,45,47],[46,40,46,47],[47,40,47,47],[47,0,47,11],[45,29,45,39],[46,29,46,39],[47,29,47,39],[45,20,45,28],[46,20,46,28],[47,20,47,28],[49,0,49,14],[49,15,49,28],[49,29,49,42],[49,43,49,57],[45,12,45,19],[46,12,46,19],[47,12,47,19],[48,0,48,57],[45,0,45,11],[46,0,46,11],[64,0,64,57],[54,33,58,57],[54,16,54,24],[54,0,54,8],[54,9,54,15],[54,25,54,32],[59,0,59,57],[57,21,57,26],[55,27,55,32],[56,27,56,32],[57,0,57,8],[58,0,58,8],[60,0,60,57],[61,0,61,57],[57,9,57,14],[58,9,58,14],[58,21,58,26],[62,0,62,57],[63,0,63,57],[57,27,57,32],[58,27,58,32],[55,15,55,20],[56,15,56,20],[57,15,57,20],[51,0,51,14],[51,15,51,28],[51,29,51,42],[51,43,51,57],[50,0,50,14],[50,15,50,28],[50,29,50,42],[50,43,50,57],[6,53,6,57],[6,47,6,52],[6,0,6,7],[6,8,6,15],[6,16,6,19],[6,20,6,28],[6,29,6,37],[6,38,6,46],[7,0,7,9],[7,10,7,16],[7,17,7,19],[7,20,7,27],[7,28,7,35],[7,36,7,42],[7,43,7,50],[7,51,7,57],[5,47,5,51],[5,39,5,42],[5,43,5,46],[3,52,3,57],[4,0,4,57],[5,6,5,28],[5,29,5,38],[3,0,3,3],[5,52,5,57],[3,46,3,51],[3,4,3,24],[3,25,3,28],[3,29,3,45],[1,0,1,15],[0,16,1,51],[0,0,0,15],[2,46,2,50],[2,51,2,57],[2,0,2,4],[2,5,2,24],[0,52,1,57],[2,25,2,29],[2,30,2,45],[8,52,8,57],[8,0,8,15],[8,16,8,21],[8,22,8,27],[8,28,8,33],[18,16,18,21],[8,34,8,39],[8,40,8,45],[8,46,8,51],[18,22,18,27],[10,16,10,21],[12,0,12,57],[13,0,13,4],[13,5,13,26],[13,27,13,37],[13,38,13,57],[11,46,11,51],[11,52,11,57],[9,34,9,39],[9,40,9,45],[10,46,10,51],[10,52,10,57],[9,46,9,51],[9,52,9,57],[10,40,10,45],[11,0,11,15],[11,16,11,21],[11,22,11,27],[11,28,11,33],[11,34,11,39],[11,40,11,45],[18,0,18,15],[19,34,19,39],[19,40,19,45],[18,40,18,45],[15,49,15,57],[14,0,14,8],[14,9,14,26],[14,38,14,57],[14,27,14,37],[15,38,15,48],[16,38,16,48],[16,49,16,57],[17,0,17,4],[17,5,17,18],[17,19,17,26],[17,27,17,37],[17,38,17,45],[17,46,17,57],[16,0,16,8],[16,9,16,18],[9,16,9,21],[9,22,9,27],[9,28,9,33],[18,28,18,33],[16,19,16,25],[16,26,16,37],[15,0,15,5],[15,6,15,37],[10,22,10,27],[9,0,9,9],[9,10,9,15],[18,34,18,39],[10,0,10,15],[10,28,10,33],[10,34,10,39],[19,46,19,51],[19,52,19,57],[19,0,19,15],[19,16,19,21],[19,22,19,27],[19,28,19,33],[20,34,20,39],[20,40,20,45],[20,46,20,51],[20,52,20,57],[20,0,20,15],[20,16,20,21],[20,22,20,27],[20,28,20,33],[21,46,21,51],[21,52,21,57],[21,0,21,15],[21,16,21,21],[21,22,21,27],[21,28,21,33],[24,0,24,8],[24,9,24,26],[24,27,24,36],[24,37,24,57],[22,0,22,57],[23,0,23,4],[23,5,23,26],[23,27,23,37],[23,38,23,57],[21,34,21,39],[21,40,21,45],[25,0,25,5],[25,6,25,37],[25,38,25,48],[25,49,25,57],[26,38,26,48],[26,49,26,57],[27,0,27,4],[27,5,27,18],[27,19,27,26],[27,27,27,37],[27,38,27,45],[29,40,29,45],[29,46,29,51],[32,52,33,57],[32,16,33,51],[33,0,33,15],[27,46,27,57],[26,0,26,8],[26,9,26,18],[26,19,26,25],[26,26,26,37],[32,0,32,15],[28,16,28,21],[28,22,28,27],[28,28,28,33],[30,16,30,21],[30,22,30,27],[30,28,30,33],[29,28,29,33],[28,34,28,39],[18,46,18,51],[18,52,18,57],[31,34,31,39],[31,40,31,45],[31,46,31,51],[31,52,31,57],[31,0,31,15],[31,16,31,21],[31,22,31,27],[31,28,31,33],[30,34,30,39],[30,40,30,45],[30,46,30,51],[30,52,30,57],[30,0,30,15],[29,52,29,57],[29,0,29,15],[29,16,29,21],[29,22,29,27],[28,40,28,45],[28,46,28,51],[28,52,28,57],[28,0,28,15],[29,34,29,39],[40,26,40,40],[40,41,40,42],[40,43,40,57],[34,0,34,57],[35,0,35,57],[36,0,36,57],[37,0,37,57],[41,0,41,6],[41,7,41,23],[41,24,41,40],[41,41,41,57],[38,0,38,57],[39,0,39,57],[40,0,40,6],[40,7,40,8],[40,9,40,23],[40,24,40,25],[43,0,43,6],[43,7,43,23],[43,24,43,40],[43,41,43,57],[42,0,42,6],[42,7,42,23],[42,24,42,40],[42,41,42,57],[44,0,44,57],[53,0,53,57],[55,0,55,8],[56,0,56,8],[55,9,55,14],[56,9,56,14],[55,21,55,26],[56,21,56,26],[52,0,52,26],[52,27,52,57]]}
["Kentucky Transportation Cabinet",null,null,null,null,null,null,null,null,null,null,null,null,null,null,null,"DRAINAGE DESIGN SUMMARY         TC 61-100",null,null,null,null,null,null,null,null,null,null,null,null,null,null,null,null,null,null,null,null,null,null,null,null,null,null,null,null,null,null,null,null,null,null,null,"1 of 2",null,null,null,null,null,null,null,null,null,null,null,null,null,null,null,null,null,null,null,null,null,null,null,null,null,null,null,null,null,null,null,null,null,null,"COUNTY"]
["Division of Highway Design  3-09",null,null,null,null,null,null,null,null,null,null,null,null,null,null,null,null,null,null,null,null,null,null,null,null,null,null,null,null,null,null,null,null,null,null,null,null,null,null,null,null,null,null,null,null,null,null,null,null,null,null,null,null,null,null,null,null,null,null,null,null,null,null,null,null,null,null,null,null,null,null,null,null,null,null,null,null,null,null,null,null,null,null,null,null,null,null,"ADAIR"]
["County :",null,null,null,null,"MARION",null,null,null,null,null,null,null,null,null,null,null,null,null,null,null,null,null,null,null,"Route :",null,null,null,null,"KY 100",null,null,null,null,null,null,null,null,null,null,null,null,null,null,null,"Item # :",null,null,null,null,"3-8503",null,null,null,null,null,null,null,null,null,null,null,null,null,null,null,null,null,null,null,null,null,null,"Low",null,null,null,null,null,null,null,null,null,null,null,null,"ALLEN"]
["UPN :",null,null,null,null,null,null,null,null,null,null,null,null,null,null,null,null,null,null,null,null,null,null,null,null,"FPN :",null,null,null,null,null,null,null,null,null,null,null,null,null,null,null,null,null,null,null,null,"Station :",null,null,null,null,null,null,null,null,null,null,null,null,null,null,null,null,null,null,null,null,null,null,null,null,null,null,null,"Medium",null,null,null,null,null,null,null,null,null,null,null,null,"ANDERSON"]
["EXISTING CONDITIONS",null,null,null,null,null,null,null,null,null,null,null,null,null,null,null,null,null,null,null,null,null,null,null,null,null,null,null,null,null,null,null,null,null,null,null,null,null,null,null,null,null,null,null,null,null,null,null,null,null,null,null,null,null,null,null,null,null,null,null,null,null,null,null,null,null,null,null,null,null,null,null,null,null,"High",null,null,null,null,null,null,null,null,null,null,null,null,"BALLARD"]
["Stream :",null,null,null,null,null,"West Bays Fork",null,null,null,null,null,null,null,null,null,null,null,null,null,null,null,null,null,null,null,null,null,null,"Drainage Area :",null,null,null,null,null,null,null,null,null,{"$f":"Regional!E9","v":0.64},null,null,null,{"$f":"Regional!E5","v":"(sq.mi.)"},null,null,null,"Slope :",null,null,null,null,null,null,null,null,null,null,null,null,null,null,null,null,null,null,null,null,null,null,null,null,null,null,null,null,null,null,null,null,null,null,null,null,null,null,null,"BARREN"]
{"$rows_left_out":116}
{"sheet":"Region1","index":5,"n_rows":0,"n_cols":0,"rows_kept":0,"cut":false,"hidden":false,"merged":[]}

{"sheet":"Region 2","index":6,"n_rows":0,"n_cols":0,"rows_kept":0,"cut":false,"hidden":false,"merged":[]}

{"sheet":"Region 3","index":7,"n_rows":0,"n_cols":0,"rows_kept":0,"cut":false,"hidden":false,"merged":[]}

{"sheet":"Region 4","index":8,"n_rows":0,"n_cols":0,"rows_kept":0,"cut":false,"hidden":false,"merged":[]}

{"sheet":"Region 5","index":9,"n_rows":0,"n_cols":0,"rows_kept":0,"cut":false,"hidden":false,"merged":[]}

{"sheet":"Region 6","index":10,"n_rows":0,"n_cols":0,"rows_kept":0,"cut":false,"hidden":false,"merged":[]}

{"sheet":"Region 7","index":11,"n_rows":0,"n_cols":0,"rows_kept":0,"cut":false,"hidden":false,"merged":[]}

{"sheet":"TN2","index":12,"n_rows":18,"n_cols":1,"rows_kept":18,"cut":false,"hidden":false,"merged":[]}
[]
[]
[]
[]
[]
[]
{"$rows_left_out":13}
{"sheet":"Coefficients","index":13,"n_rows":45,"n_cols":40,"rows_kept":45,"cut":false,"hidden":false,"merged":[[11,0,11,6],[22,1,22,7],[22,0,23,0],[18,0,18,2],[19,0,19,2],[13,0,13,2],[12,0,12,2],[15,0,15,2],[14,0,14,2],[21,0,21,7],[16,0,16,2],[17,0,17,2],[40,0,40,2],[32,0,32,10],[34,0,34,2],[35,0,35,2],[36,0,36,2],[37,0,37,2],[39,0,39,2],[38,0,38,2],[33,0,33,2]]}
["Region: 1",null,null,null,null,"Region: 2",null,null,null,"Region: 3",null,null,null,"Region: 4",null,null,null,"Region: 5",null,null,null,"Region: 6",null,null,null,"Region: 7",null,null,null,"Region: TN1",null,null,null,"Region: TN2",null,null,null,"Region: TN4"]
["RI","K","a","c",null,"K","a","c",null,"K","a","c",null,"K","a","c",null,"K","a","c",null,"K","a","c",null,"K","a","c",null,"K","a","c",null,"K","a","c",null,"K","a","c"]
[2,312,0.67300000000000004,0,null,152,0.72799999999999998,0,null,187,0.748,0,null,39,0.92300000000000004,0.20399999999999999,null,260,0.70399999999999996,0,null,256,0.6,0,null,293,0.623,0,null,119,0.755,0,null,204,0.72699999999999998,0,null,436,0.52700000000000002,0]
[5,493,0.65100000000000002,0,null,239,0.72099999999999997,0,null,355,0.71199999999999997,0,null,69.8,0.89400000000000002,0.186,null,437,0.69199999999999995,0,null,397,0.58599999999999997,0,null,476,0.61599999999999999,0,null,197,0.74,0,null,340,0.71599999999999997,0,null,618,0.54500000000000004,0]
[10,91.5,0.84299999999999997,0.45100000000000001,null,304,0.71499999999999997,0,null,498,0.69199999999999995,0,null,92.7,0.88200000000000001,0.17799999999999999,null,571,0.68600000000000005,0,null,499,0.57799999999999996,0,null,614,0.61299999999999999,0,null,258,0.73099999999999998,0,null,439,0.71199999999999997,0,null,735,0.55400000000000005,0]
[25,81.2,0.872,0.53500000000000003,null,393,0.70899999999999996,0,null,714,0.67,0,null,121,0.873,0.17299999999999999,null,754,0.68200000000000005,0,null,636,0.56899999999999995,0,null,804,0.61,0,null,342,0.72199999999999998,0,null,573,0.70899999999999996,0,null,878,0.56399999999999995,0]
{"$rows_left_out":40}
{"sheet":"Table 1","index":14,"n_rows":565,"n_cols":13,"rows_kept":565,"cut":false,"hidden":false,"merged":[[0,2,1,8],[2,10,3,10]]}
[null,null,"Peak flow (cubic feet per second) for given recurrence interval"]
["Station","Code"]
["number",null,2,5,10,25,50,100,500,"Ag","Region"]
[null,null,"years","years","years","years","years","years","years","(sq.mi)"]
[3207965,"G",696,1090,1360,1700,1940,2190,2740,6.2,2]
[null,"R",574,891,1120,1430,1680,1930,2540]
{"$rows_left_out":560}
{"sheet":"P2,2","index":15,"n_rows":124,"n_cols":2,"rows_kept":124,"cut":false,"hidden":true,"merged":[]}
["COUNTY","P2,2"]
["ADAIR",1.8]
["ALLEN",1.8]
["ANDERSON",1.7]
["BALLARD",1.9]
["BARREN",1.8]
{"$rows_left_out":119}
{"sheet":"Update Log","index":16,"n_rows":6,"n_cols":2,"rows_kept":6,"cut":false,"hidden":false,"merged":[[3,1,3,18],[0,1,0,18],[4,1,4,18],[5,1,5,18],[17,1,17,18],[6,1,6,18],[7,1,7,18],[8,1,8,18],[9,1,9,18],[10,1,10,18],[11,1,11,18],[12,1,12,18],[13,1,13,18],[14,1,14,18],[15,1,15,18],[16,1,16,18],[38,1,38,18],[39,1,39,18],[30,1,30,18],[31,1,31,18],[32,1,32,18],[33,1,33,18],[34,1,34,18],[35,1,35,18],[37,1,37,18],[28,1,28,18],[2,1,2,18],[1,1,1,18],[1,0,2,0],[36,1,36,18],[29,1,29,18],[18,1,18,18],[19,1,19,18],[20,1,20,18],[21,1,21,18],[22,1,22,18],[23,1,23,18],[24,1,24,18],[25,1,25,18],[26,1,26,18],[27,1,27,18]]}
["Date","Description of Change or Edit"]
[null,"Provided a one-way conversion option for drainage area from acres to sq. miles and flow path length from feet to miles.  Conversion from sq. miles to acres or miles to feet is not provided."]
[null,"If \"sq. miles\" or \"miles\" are selected, no conversion is performed."]
["2016-12-01","Corrected slope calc for regional flow.  Other cosmetic changes."]
["2017-02-17","Corrected all entries to zero out numeric cells and to blank out all alpha cells when area id or area is blank or zero.  Simplified urban spreadsheet."]
["2019-07-02","Corrected label display for Jefferson County urban flows.  Added check for county name in urban calculations for P2,2."]